Reaction Details
TargetCathepsin S
LigandBDBM50414640
Substrate/Competitorn/a
Meas. Tech.ChEMBL_581589 (CHEMBL1062476)
IC50 316.23±n/a nM
Citation Bethel, PAGerhardt, SJones, EVKenny, PWKaroutchi, GIMorley, ADOldham, KRankine, NAugustin, MKrapp, SSimader, HSteinbacher, S Design of selective Cathepsin inhibitors. Bioorg Med Chem Lett19:4622-5 (2009) 
 
Cathepsin S
Name:Cathepsin S
Type:Protein
Mol. Mass.:37507.38
Organism:Homo sapiens (Human)
Description:P25774
Residue:331
BDBM50414640
NameBDBM50414640
Synonyms:CHEMBL562844
TypeSmall organic molecule
Emp. Form.C23H27N7O2S
Mol. Mass.465.571
SMILESCc1nnc(s1)-c1cccc(CC(NC(=O)c2cc(nn2C)C(C)(C)C)C(=O)NCC#N)c1