Reaction Details
TargetCathepsin K
LigandBDBM50414642
Substrate/Competitorn/a
Meas. Tech.ChEMBL_581588 (CHEMBL1062475)
IC50 100±n/a nM
Citation Bethel, PAGerhardt, SJones, EVKenny, PWKaroutchi, GIMorley, ADOldham, KRankine, NAugustin, MKrapp, SSimader, HSteinbacher, S Design of selective Cathepsin inhibitors. Bioorg Med Chem Lett19:4622-5 (2009) 
 
Cathepsin K
Name:Cathepsin K
Type:Enzyme
Mol. Mass.:36975.68
Organism:Homo sapiens (Human)
Description:P43235
Residue:329
BDBM50414642
NameBDBM50414642
Synonyms:CHEMBL549791
TypeSmall organic molecule
Emp. Form.C23H27N7O4
Mol. Mass.465.505
SMILESCn1nc(cc1C(=O)NC(Cc1cccc(c1)-c1nnc(CO)o1)C(=O)NCC#N)C(C)(C)C