Reaction Details
TargetCathepsin L2
LigandBDBM50414643
Substrate/Competitorn/a
Meas. Tech.ChEMBL_581586 (CHEMBL1062473)
IC50 39.81±n/a nM
Citation Bethel, PAGerhardt, SJones, EVKenny, PWKaroutchi, GIMorley, ADOldham, KRankine, NAugustin, MKrapp, SSimader, HSteinbacher, S Design of selective Cathepsin inhibitors. Bioorg Med Chem Lett19:4622-5 (2009) 
 
Cathepsin L2
Name:Cathepsin L2
Type:Enzyme
Mol. Mass.:37341.06
Organism:Homo sapiens (Human)
Description:O60911
Residue:334
BDBM50414643
NameBDBM50414643
Synonyms:CHEMBL557455
TypeSmall organic molecule
Emp. Form.C23H28N8O3
Mol. Mass.464.5202
SMILESCn1nc(cc1C(=O)NC(Cc1cccc(c1)-c1nnc(CN)o1)C(=O)NCC#N)C(C)(C)C