Reaction Details
TargetAndrogen receptor
LigandBDBM50415096
Substrate/Competitorn/a
Meas. Tech.ChEMBL_597011 (CHEMBL1041855)
EC50 3.98±n/a nM
Citation Schlienger, NLund, BWPawlas, JBadalassi, FBertozzi, FLewinsky, RFejzic, AThygesen, MBTabatabaei, ABradley, SRGardell, LRPiu, FOlsson, R Synthesis, structure-activity relationships, and characterization of novel nonsteroidal and selective androgen receptor modulators. J Med Chem52:7186-91 (2009) 
 
Androgen receptor
Name:Androgen receptor
Type:PROTEIN
Mol. Mass.:98196.62
Organism:Mus musculus
Description:ChEMBL_945930
Residue:899
BDBM50415096
NameBDBM50415096
Synonyms:CHEMBL568814
TypeSmall organic molecule
Emp. Form.C20H22N2O
Mol. Mass.306.4015
SMILESCCC1(O)C[C@H]2CC[C@H](C1)N2c1ccc(C#N)c2ccccc12