Reaction Details
TargetCannabinoid receptor 2
LigandBDBM50415307
Substrate/Competitorn/a
Meas. Tech.ChEMBL_605640 (CHEMBL1070562)
EC50 6.31±n/a nM
Citation Gleave, RJBeswick, PJBrown, AJGiblin, GMGoldsmith, PHaslam, CPMitchell, WLNicholson, NHPage, LWPatel, SRoomans, SSlingsby, BPSwarbrick, ME Synthesis and evaluation of 3-amino-6-aryl-pyridazines as selective CB(2) agonists for the treatment of inflammatory pain. Bioorg Med Chem Lett20:465-8 (2010) 
 
Cannabinoid receptor 2
Name:Cannabinoid receptor 2
Type:G Protein-Coupled Receptor (GPCR)
Mol. Mass.:39690.94
Organism:Homo sapiens (Human)
Description:P34972
Residue:360
BDBM50415307
NameBDBM50415307
Synonyms:CHEMBL594281
TypeSmall organic molecule
Emp. Form.C15H15Cl2N3
Mol. Mass.308.206
SMILESClc1cccc(c1Cl)-c1ccc(nn1)N1CCCCC1