Reaction Details
TargetCannabinoid receptor 2
LigandBDBM50415315
Substrate/Competitorn/a
Meas. Tech.ChEMBL_605640 (CHEMBL1070562)
EC50 1584.89±n/a nM
Citation Gleave, RJBeswick, PJBrown, AJGiblin, GMGoldsmith, PHaslam, CPMitchell, WLNicholson, NHPage, LWPatel, SRoomans, SSlingsby, BPSwarbrick, ME Synthesis and evaluation of 3-amino-6-aryl-pyridazines as selective CB(2) agonists for the treatment of inflammatory pain. Bioorg Med Chem Lett20:465-8 (2010) 
 
Cannabinoid receptor 2
Name:Cannabinoid receptor 2
Type:G Protein-Coupled Receptor (GPCR)
Mol. Mass.:39690.94
Organism:Homo sapiens (Human)
Description:P34972
Residue:360
BDBM50415315
NameBDBM50415315
Synonyms:CHEMBL593835
TypeSmall organic molecule
Emp. Form.C14H14ClN3O
Mol. Mass.275.733
SMILESClc1ccccc1-c1ccc(nn1)N1CCOCC1