Reaction Details
TargetCannabinoid receptor 1
LigandBDBM50415329
Substrate/Competitorn/a
Meas. Tech.ChEMBL_605642 (CHEMBL1070564)
EC50 19952.62±n/a nM
Citation Gleave, RJBeswick, PJBrown, AJGiblin, GMGoldsmith, PHaslam, CPMitchell, WLNicholson, NHPage, LWPatel, SRoomans, SSlingsby, BPSwarbrick, ME Synthesis and evaluation of 3-amino-6-aryl-pyridazines as selective CB(2) agonists for the treatment of inflammatory pain. Bioorg Med Chem Lett20:465-8 (2010) 
 
Cannabinoid receptor 1
Name:Cannabinoid receptor 1
Type:G Protein-Coupled Receptor (GPCR)
Mol. Mass.:52868.96
Organism:Homo sapiens (Human)
Description:P21554
Residue:472
BDBM50415329
NameBDBM50415329
Synonyms:CHEMBL610914
TypeSmall organic molecule
Emp. Form.C19H20N4
Mol. Mass.304.3889
SMILESC[C@H]1CC[C@@H](C)N1c1ccc(nn1)-c1cccc2cnccc12