Reaction Details
TargetHistamine H4 receptor
LigandBDBM50397290
Substrate/Competitorn/a
Meas. Tech.ChEMBL_613511 (CHEMBL1072277)
Ki 1737.8±n/a nM
Citation Smits, RAAdami, MIstyastono, EPZuiderveld, OPvan Dam, CMde Kanter, FJJongejan, ACoruzzi, GLeurs, Rde Esch, IJ Synthesis and QSAR of quinazoline sulfonamides as highly potent human histamine H4 receptor inverse agonists. J Med Chem53:2390-400 (2010) 
 
Histamine H4 receptor
Name:Histamine H4 receptor
Type:G Protein-Coupled Receptor (GPCR)
Mol. Mass.:44517.02
Organism:Homo sapiens (Human)
Description:Binding assays were using CHO cells stably expressing hH4R receptors.
Residue:390
BDBM50397290
NameBDBM50397290
Synonyms:CHEMBL475331 | VUF-10147
TypeSmall organic molecule
Emp. Form.C13H17N5
Mol. Mass.243.3076
SMILESCN1CCN(CC1)c1nc(N)c2ccccc2n1