Reaction Details
TargetHistamine H4 receptor
LigandBDBM50412512
Substrate/Competitorn/a
Meas. Tech.ChEMBL_613511 (CHEMBL1072277)
Ki 35.48±n/a nM
Citation Smits, RAAdami, MIstyastono, EPZuiderveld, OPvan Dam, CMde Kanter, FJJongejan, ACoruzzi, GLeurs, Rde Esch, IJ Synthesis and QSAR of quinazoline sulfonamides as highly potent human histamine H4 receptor inverse agonists. J Med Chem53:2390-400 (2010) 
 
Histamine H4 receptor
Name:Histamine H4 receptor
Type:G Protein-Coupled Receptor (GPCR)
Mol. Mass.:44517.02
Organism:Homo sapiens (Human)
Description:Binding assays were using CHO cells stably expressing hH4R receptors.
Residue:390
BDBM50412512
NameBDBM50412512
Synonyms:CHEMBL509142 | VUF-10507
TypeSmall organic molecule
Emp. Form.C18H20ClN5S
Mol. Mass.373.903
SMILESCN1CCN(CC1)c1nc(NCc2ccsc2)c2cc(Cl)ccc2n1