Reaction Details
TargetHistamine H4 receptor
LigandBDBM22914
Substrate/Competitorn/a
Meas. Tech.ChEMBL_613511 (CHEMBL1072277)
Ki 63.1±n/a nM
Citation Smits, RAAdami, MIstyastono, EPZuiderveld, OPvan Dam, CMde Kanter, FJJongejan, ACoruzzi, GLeurs, Rde Esch, IJ Synthesis and QSAR of quinazoline sulfonamides as highly potent human histamine H4 receptor inverse agonists. J Med Chem53:2390-400 (2010) 
 
Histamine H4 receptor
Name:Histamine H4 receptor
Type:G Protein-Coupled Receptor (GPCR)
Mol. Mass.:44517.02
Organism:Homo sapiens (Human)
Description:Binding assays were using CHO cells stably expressing hH4R receptors.
Residue:390
BDBM22914
NameBDBM22914
Synonyms:CHEMBL260374 Thioperamide | US11622967, Compound Thioperamide
TypeSmall organic molecule
Emp. Form.C15H24N4S
Mol. Mass.292.443
SMILESS=C(NC1CCCCC1)N1CCC(CC1)c1cnc[nH]1