Reaction Details
TargetFalcipain-2
LigandBDBM50415534
Substrate/Competitorn/a
Meas. Tech.ChEMBL_612226 (CHEMBL1074166)
IC50>100000±n/a nM
Citation Hans, RHGuantai, EMLategan, CSmith, PJWan, BFranzblau, SGGut, JRosenthal, PJChibale, K Synthesis, antimalarial and antitubercular activity of acetylenic chalcones. Bioorg Med Chem Lett20:942-4 (2010) 
 
Falcipain-2
Name:Falcipain-2
Synonyms:n/a
Type:Enzyme
Mol. Mass.:55912.57
Organism:Plasmodium falciparum
Description:n/a
Residue:484
BDBM50415534
NameBDBM50415534
Synonyms:CHEMBL606235
TypeSmall organic molecule
Emp. Form.C19H16O3
Mol. Mass.292.3285
SMILESCOc1ccc(\C=C\C(=O)c2ccc(OCC#C)cc2)cc1