Reaction Details
TargetBeta-3 adrenergic receptor
LigandBDBM25771
Substrate/Competitorn/a
Meas. Tech.ChEMBL_634435 (CHEMBL1119461)
EC50 1259±n/a nM
Citation Procopiou, PABarrett, VJBevan, NJBiggadike, KBox, PCButchers, PRCoe, DMConroy, REmmons, AFord, AJHolmes, DSHorsley, HKerr, FLi-Kwai-Cheung, AMLooker, BEMann, ISMcLay, IMMorrison, VSMutch, PJSmith, CETomlin, P Synthesis and structure-activity relationships of long-acting beta2 adrenergic receptor agonists incorporating metabolic inactivation: an antedrug approach. J Med Chem53:4522-30 (2010) 
 
Beta-3 adrenergic receptor
Name:Beta-3 adrenergic receptor
Type:G Protein-Coupled Receptor (GPCR)
Mol. Mass.:43534.88
Organism:Homo sapiens (Human)
Description:n/a
Residue:408
BDBM25771
NameBDBM25771
Synonyms:1-hydroxy-2-naphthoic acid;4-[1-hydroxy-2-[6-(4-phenylbutoxy)hexylamino]ethyl]-2-methylol-phenol Aeromax Serevent | salmeterol xinafoate
TypeSmall organic molecule
Emp. Form.C25H37NO4
Mol. Mass.415.5656
SMILESOCc1cc(ccc1O)C(O)CNCCCCCCOCCCCc1ccccc1