Reaction Details
TargetP2X purinoceptor 7
LigandBDBM50416377
Substrate/Competitorn/a
Meas. Tech.ChEMBL_643414 (CHEMBL1212278)
IC50 10±n/a nM
Citation Beswick, PJBillinton, AChambers, LJDean, DKFonfria, EGleave, RJMedhurst, SJMichel, ADMoses, APPatel, SRoman, SARoomans, SSenger, SStevens, AJWalter, DS Structure-activity relationships and in vivo activity of (1H-pyrazol-4-yl)acetamide antagonists of the P2X(7) receptor. Bioorg Med Chem Lett20:4653-6 (2010) 
 
P2X purinoceptor 7
Name:P2X purinoceptor 7
Type:Protein
Mol. Mass.:68602.85
Organism:Homo sapiens (Human)
Description:Q99572
Residue:595
BDBM50416377
NameBDBM50416377
Synonyms:CHEMBL1210621
TypeSmall organic molecule
Emp. Form.C14H12ClF4N3O
Mol. Mass.349.711
SMILESCn1ncc(F)c1CC(=O)NCc1cccc(c1Cl)C(F)(F)F