Reaction Details
TargetExtracellular calcium-sensing receptor
LigandBDBM50416879
Substrate/Competitorn/a
Meas. Tech.ChEMBL_664261 (CHEMBL1261768)
EC50 100±n/a nM
Citation Gustafsson, MJensen, JBertozzi, SMCurrier, EAMa, JNBurstein, ESOlsson, R Discovery of a class of calcium sensing receptor positive allosteric modulators; 1-(benzothiazol-2-yl)-1-phenylethanols. Bioorg Med Chem Lett20:5918-21 (2010) 
 
Extracellular calcium-sensing receptor
Name:Extracellular calcium-sensing receptor
Type:Protein
Mol. Mass.:120663.13
Organism:Homo sapiens (Human)
Description:P41180
Residue:1078
BDBM50416879
NameBDBM50416879
Synonyms:CHEMBL1256303
TypeSmall organic molecule
Emp. Form.C15H11Cl2NOS
Mol. Mass.324.225
SMILESCC(O)(c1nc2ccccc2s1)c1ccc(Cl)c(Cl)c1