Reaction Details
TargetNeuropeptide Y receptor type 5
LigandBDBM50417040
Substrate/Competitorn/a
Meas. Tech.ChEMBL_664979 (CHEMBL1259936)
Ki 0.158±n/a nM
Citation Leslie, CPBentley, JBiagetti, MContini, SDi Fabio, RDonati, DGenski, TGuery, SMazzali, AMerlo, GPizzi, DASacco, FSeri, CTessari, MZonzini, LCaberlotto, L Discovery and structure-activity relationship of a novel spirocarbamate series of NPY Y5 antagonists. Bioorg Med Chem Lett20:6103-7 (2010) 
 
Neuropeptide Y receptor type 5
Name:Neuropeptide Y receptor type 5
Type:Enzyme
Mol. Mass.:50746.64
Organism:Homo sapiens (Human)
Description:Q15761
Residue:445
BDBM50417040
NameBDBM50417040
Synonyms:CHEMBL1257760
TypeSmall organic molecule
Emp. Form.C23H24N6O2
Mol. Mass.416.4757
SMILESO=C1O[C@@]2(CN1c1ccccn1)CC[C@H](CNc1ccc(cn1)-c1ncccn1)CC2