Reaction Details
TargetP2X purinoceptor 7
LigandBDBM50416383
Substrate/Competitorn/a
Meas. Tech.ChEMBL_676106 (CHEMBL1273100)
IC50 79.43±n/a nM
Citation Abberley, LBebius, ABeswick, PJBillinton, ACollis, KLDean, DKFonfria, EGleave, RJMedhurst, SJMichel, ADMoses, APPatel, SRoman, SAScoccitti, TSmith, BSteadman, JGWalter, DS Identification of 2-oxo-N-(phenylmethyl)-4-imidazolidinecarboxamide antagonists of the P2X(7) receptor. Bioorg Med Chem Lett20:6370-4 (2010) 
 
P2X purinoceptor 7
Name:P2X purinoceptor 7
Type:Protein
Mol. Mass.:68403.50
Organism:Rattus norvegicus (Rat)
Description:Q64663
Residue:595
BDBM50416383
NameBDBM50416383
Synonyms:CHEMBL1210558
TypeSmall organic molecule
Emp. Form.C14H15Cl2N3O
Mol. Mass.312.194
SMILESCc1n[nH]c(C)c1CC(=O)NCc1ccc(Cl)cc1Cl