Reaction Details
TargetVitamin D3 receptor
LigandBDBM50417519
Substrate/Competitorn/a
Meas. Tech.ChEMBL_695917 (CHEMBL1641104)
Ki 1±n/a nM
Citation Grzywacz, PChiellini, GPlum, LAClagett-Dame, MDeLuca, HF Removal of the 26-methyl group from 19-nor-1a,25-dihydroxyvitamin D3 markedly reduces in vivo calcemic activity without altering in vitro VDR binding, HL-60 cell differentiation, and transcription. J Med Chem53:8642-9 (2010) 
 
Vitamin D3 receptor
Name:Vitamin D3 receptor
Type:PROTEIN
Mol. Mass.:47811.07
Organism:Rattus norvegicus
Description:ChEMBL_1505946
Residue:423
BDBM50417519
NameBDBM50417519
Synonyms:CHEMBL1630759
TypeSmall organic molecule
Emp. Form.C26H44O3
Mol. Mass.404.6258
SMILESC[C@@H](O)CCC[C@H](C)[C@H]1CC[C@H]2\C(CCC[C@]12C)=C\C=C1C[C@@H](O)C(C)[C@H](O)C1