Reaction Details
TargetVitamin D3 receptor
LigandBDBM50417520
Substrate/Competitorn/a
Meas. Tech.ChEMBL_695918 (CHEMBL1641105)
Ki 0.06±n/a nM
Citation Grzywacz, PChiellini, GPlum, LAClagett-Dame, MDeLuca, HF Removal of the 26-methyl group from 19-nor-1a,25-dihydroxyvitamin D3 markedly reduces in vivo calcemic activity without altering in vitro VDR binding, HL-60 cell differentiation, and transcription. J Med Chem53:8642-9 (2010) 
 
Vitamin D3 receptor
Name:Vitamin D3 receptor
Type:PROTEIN
Mol. Mass.:47811.07
Organism:Rattus norvegicus
Description:ChEMBL_1505946
Residue:423
BDBM50417520
NameBDBM50417520
Synonyms:CHEMBL1630753
TypeSmall organic molecule
Emp. Form.C27H42O3
Mol. Mass.414.6206
SMILESC[C@H](O)CCC[C@H](C)[C@H]1CC[C@H]2\C(CCC[C@]12C)=C\C=C1\C[C@@H](O)C(=C)[C@H](O)C1=C