Reaction Details
TargetPotassium voltage-gated channel subfamily H member 2
LigandBDBM14027
Substrate/Competitorn/a
Meas. Tech.ChEMBL_700343 (CHEMBL1647669)
Ki 25118.86±n/a nM
Citation Ray, PWright, JAdam, JBennett, JBoucharens, SBlack, DCook, ABrown, AREpemolu, OFletcher, DHaunso, AHuggett, MJones, PLaats, SLyons, AMestres, Jde Man, JMorphy, RRankovic, ZSherborne, BSherry, Lvan Straten, NWestwood, PZaman, GZ Fragment-based discovery of 6-substituted isoquinolin-1-amine based ROCK-I inhibitors. Bioorg Med Chem Lett21:97-101 (2010) 
 
Potassium voltage-gated channel subfamily H member 2
Name:Potassium voltage-gated channel subfamily H member 2
Type:Multi-pass membrane protein
Mol. Mass.:126672.65
Organism:Homo sapiens (Human)
Description:Q12809
Residue:1159
BDBM14027
NameBDBM14027
Synonyms:5-(1,4-diazepan-1-ylsulfonyl)isoquinoline AT877 CHEMBL541388 HA-1077 cid_163751
TypeSmall organic molecule
Emp. Form.C14H17N3O2S
Mol. Mass.291.369
SMILESO=S(=O)(N1CCCNCC1)c1cccc2cnccc12