Reaction Details
TargetRho-associated protein kinase 1
LigandBDBM50417670
Substrate/Competitorn/a
Meas. Tech.ChEMBL_700338 (CHEMBL1647664)
IC50 588.84±n/a nM
Citation Ray, PWright, JAdam, JBennett, JBoucharens, SBlack, DCook, ABrown, AREpemolu, OFletcher, DHaunso, AHuggett, MJones, PLaats, SLyons, AMestres, Jde Man, JMorphy, RRankovic, ZSherborne, BSherry, Lvan Straten, NWestwood, PZaman, GZ Fragment-based discovery of 6-substituted isoquinolin-1-amine based ROCK-I inhibitors. Bioorg Med Chem Lett21:97-101 (2010) 
 
Rho-associated protein kinase 1
Name:Rho-associated protein kinase 1
Type:Serine/threonine-protein kinase
Mol. Mass.:158156.77
Organism:Homo sapiens (Human)
Description:Q13464
Residue:1354
BDBM50417670
NameBDBM50417670
Synonyms:CHEMBL1643357
TypeSmall organic molecule
Emp. Form.C18H19N3O
Mol. Mass.293.363
SMILESNc1nccc2cc(CNCCOc3ccccc3)ccc12