Reaction Details
TargetHistamine H4 receptor
LigandBDBM50418066
Substrate/Competitorn/a
Meas. Tech.ChEMBL_735234 (CHEMBL1694496)
Ki 7.94±n/a nM
Citation Wijtmans, Mde Graaf, Cde Kloe, GIstyastono, EPSmit, JLim, HBoonnak, RNijmeijer, SSmits, RAJongejan, AZuiderveld, Ode Esch, IJLeurs, R Triazole ligands reveal distinct molecular features that induce histamine H4 receptor affinity and subtly govern H4/H3 subtype selectivity. J Med Chem54:1693-703 (2011) 
 
Histamine H4 receptor
Name:Histamine H4 receptor
Type:G Protein-Coupled Receptor (GPCR)
Mol. Mass.:44517.02
Organism:Homo sapiens (Human)
Description:Binding assays were using CHO cells stably expressing hH4R receptors.
Residue:390
BDBM50418066
NameBDBM50418066
Synonyms:CHEMBL1688976
TypeSmall organic molecule
Emp. Form.C14H21N5
Mol. Mass.259.35
SMILESC(Cc1cnc[nH]1)Cn1cc(CC2CCCC2)nn1