Reaction Details
TargetfMet-Leu-Phe receptor
LigandBDBM50418359
Substrate/Competitorn/a
Meas. Tech.ChEMBL_744724 (CHEMBL1772745)
IC50 794±n/a nM
Citation Unitt, JFagura, MPhillips, TKing, SPerry, MMorley, AMacDonald, CWeaver, RChristie, JBarber, SMohammed, RPaul, MCook, ABaxter, A Discovery of small molecule human FPR1 receptor antagonists. Bioorg Med Chem Lett21:2991-7 (2011) 
 
fMet-Leu-Phe receptor
Name:fMet-Leu-Phe receptor
Type:Enzyme Catalytic Domain
Mol. Mass.:38456.14
Organism:Homo sapiens (Human)
Description:gi_4503779
Residue:350
BDBM50418359
NameBDBM50418359
Synonyms:CHEMBL1770302
TypeSmall organic molecule
Emp. Form.C23H28N2O3
Mol. Mass.380.48
SMILESCc1cccc(C)c1NC(=O)C(NC(=O)c1ccccc1O)C1CCCCC1