Reaction Details
TargetVasopressin V1a receptor
LigandBDBM50418400
Substrate/Competitorn/a
Meas. Tech.ChEMBL_746762 (CHEMBL1776931)
Ki 56.23±n/a nM
Citation Napier, SWishart, GArbuckle, WBaker, JBarn, DBingham, MBrown, AByford, AClaxton, CCraighead, MBuchanan, KFielding, LGibson, LGoodwin, RGoutcher, SIrving, NMacSweeney, CMilne, RMort, CPresland, JSloan, HThomson, FTurnbull, ZYoung, T The discovery of novel 8-azabicyclo[3.2.1]octan-3-yl)-3-(4-chlorophenyl) propanamides as vasopressin V1A receptor antagonists. Bioorg Med Chem Lett21:3163-7 (2011) 
 
Vasopressin V1a receptor
Name:Vasopressin V1a receptor
Type:Receptor
Mol. Mass.:46820.18
Organism:Homo sapiens (Human)
Description:P37288
Residue:418
BDBM50418400
NameBDBM50418400
Synonyms:CHEMBL1773996
TypeSmall organic molecule
Emp. Form.C29H43ClN4O4S
Mol. Mass.579.194
SMILESCCN(CCCN1CCN(C)CC1)C(=O)[C@H](Cc1ccc(Cl)cc1)NS(=O)(=O)c1c(C)cc(OC)c(C)c1C