Reaction Details
TargetCytochrome P450 2C9
LigandBDBM50418605
Substrate/Competitorn/a
Meas. Tech.ChEMBL_749735 (CHEMBL1787756)
IC50 15848.93±n/a nM
Citation Aston, NMBamborough, PBuckton, JBEdwards, CDHolmes, DSJones, KLPatel, VKSmee, PASomers, DOVitulli, GWalker, AL p38alpha mitogen-activated protein kinase inhibitors: optimization of a series of biphenylamides to give a molecule suitable for clinical progression. J Med Chem52:6257-69 (2009) 
 
Cytochrome P450 2C9
Name:Cytochrome P450 2C9
Type:Enzyme
Mol. Mass.:55636.33
Organism:Homo sapiens (Human)
Description:P11712
Residue:490
BDBM50418605
NameBDBM50418605
Synonyms:CHEMBL1784171
TypeSmall organic molecule
Emp. Form.C22H25FN2O3
Mol. Mass.384.4439
SMILESCc1c(F)cc(cc1-c1ccc(cc1)C(=O)NCC(C)(C)O)C(=O)NC1CC1