Reaction Details
TargetMitogen-activated protein kinase 11
LigandBDBM50418606
Substrate/Competitorn/a
Meas. Tech.ChEMBL_749732 (CHEMBL1787753)
Ki 25.12±n/a nM
Citation Aston, NMBamborough, PBuckton, JBEdwards, CDHolmes, DSJones, KLPatel, VKSmee, PASomers, DOVitulli, GWalker, AL p38alpha mitogen-activated protein kinase inhibitors: optimization of a series of biphenylamides to give a molecule suitable for clinical progression. J Med Chem52:6257-69 (2009) 
 
Mitogen-activated protein kinase 11
Name:Mitogen-activated protein kinase 11
Type:Enzyme Catalytic Domain
Mol. Mass.:41351.73
Organism:Homo sapiens (Human)
Description:gi_20128774
Residue:364
BDBM50418606
NameBDBM50418606
Synonyms:CHEMBL1784172
TypeSmall organic molecule
Emp. Form.C21H22FN3O2
Mol. Mass.367.4167
SMILESCc1c(F)cc(cc1-c1ccc(cn1)C(=O)NCC1CC1)C(=O)NC1CC1