Reaction Details
TargetMitogen-activated protein kinase 11
LigandBDBM50418610
Substrate/Competitorn/a
Meas. Tech.ChEMBL_749732 (CHEMBL1787753)
Ki 25.12±n/a nM
Citation Aston, NMBamborough, PBuckton, JBEdwards, CDHolmes, DSJones, KLPatel, VKSmee, PASomers, DOVitulli, GWalker, AL p38alpha mitogen-activated protein kinase inhibitors: optimization of a series of biphenylamides to give a molecule suitable for clinical progression. J Med Chem52:6257-69 (2009) 
 
Mitogen-activated protein kinase 11
Name:Mitogen-activated protein kinase 11
Type:Enzyme Catalytic Domain
Mol. Mass.:41351.73
Organism:Homo sapiens (Human)
Description:gi_20128774
Residue:364
BDBM50418610
NameBDBM50418610
Synonyms:GW-856553 LOSMAPIMOD | US10550073, Comparative example
TypeSmall organic molecule
Emp. Form.C22H26FN3O2
Mol. Mass.383.4591
SMILESCc1c(F)cc(cc1-c1ccc(cn1)C(=O)NCC(C)(C)C)C(=O)NC1CC1