Reaction Details
TargetCytochrome P450 2C9
LigandBDBM50418612
Substrate/Competitorn/a
Meas. Tech.ChEMBL_749735 (CHEMBL1787756)
IC50 31622.78±n/a nM
Citation Aston, NMBamborough, PBuckton, JBEdwards, CDHolmes, DSJones, KLPatel, VKSmee, PASomers, DOVitulli, GWalker, AL p38alpha mitogen-activated protein kinase inhibitors: optimization of a series of biphenylamides to give a molecule suitable for clinical progression. J Med Chem52:6257-69 (2009) 
 
Cytochrome P450 2C9
Name:Cytochrome P450 2C9
Type:Enzyme
Mol. Mass.:55636.33
Organism:Homo sapiens (Human)
Description:P11712
Residue:490
BDBM50418612
NameBDBM50418612
Synonyms:CHEMBL1784177
TypeSmall organic molecule
Emp. Form.C23H28FN3O2
Mol. Mass.397.4857
SMILESC[C@H](NC(=O)c1ccc(nc1)-c1cc(cc(F)c1C)C(=O)NC1CC1)C(C)(C)C