Reaction Details
TargetMitogen-activated protein kinase 14
LigandBDBM50418613
Substrate/Competitorn/a
Meas. Tech.ChEMBL_749734 (CHEMBL1787755)
IC50 316.23±n/a nM
Citation Aston, NMBamborough, PBuckton, JBEdwards, CDHolmes, DSJones, KLPatel, VKSmee, PASomers, DOVitulli, GWalker, AL p38alpha mitogen-activated protein kinase inhibitors: optimization of a series of biphenylamides to give a molecule suitable for clinical progression. J Med Chem52:6257-69 (2009) 
 
Mitogen-activated protein kinase 14
Name:Mitogen-activated protein kinase 14
Type:Serine/threonine-protein kinase
Mol. Mass.:41286.76
Organism:Homo sapiens (Human)
Description:Q16539
Residue:360
BDBM50418613
NameBDBM50418613
Synonyms:CHEMBL1232887
TypeSmall organic molecule
Emp. Form.C21H23N3O2
Mol. Mass.349.4262
SMILESCc1ccc(cc1-c1ccc(cn1)C(=O)NCC1CC1)C(=O)NC1CC1