Reaction Details
TargetBeta-2 adrenergic receptor
LigandBDBM25769
Substrate/Competitorn/a
Meas. Tech.ChEMBL_756114 (CHEMBL1804370)
EC50 200±n/a nM
Citation Stocks, MJAlcaraz, LBailey, ABonnert, RCadogan, EChristie, JConnolly, SCook, AFisher, AFlaherty, AHill, SHumphries, AIngall, AJordan, SLawson, MMullen, ANicholls, DPaine, SPairaudeau, GSt-Gallay, SYoung, A Design driven HtL: The discovery and synthesis of new high efficacyß2-agonists. Bioorg Med Chem Lett21:4027-31 (2011) 
 
Beta-2 adrenergic receptor
Name:Beta-2 adrenergic receptor
Type:n/a
Mol. Mass.:46461.69
Organism:Homo sapiens (Human)
Description:P07550
Residue:413
BDBM25769
NameBDBM25769
Synonyms:4-[2-(tert-butylamino)-1-hydroxyethyl]-2-(hydroxymethyl)phenol Proventil Salbutamol,(+/-) | albuterol
TypeSmall organic molecule
Emp. Form.C13H21NO3
Mol. Mass.239.3107
SMILESCC(C)(C)NCC(O)c1ccc(O)c(CO)c1