Reaction Details
TargetOrexin/Hypocretin receptor type 1
LigandBDBM50419132
Substrate/Competitorn/a
Meas. Tech.ChEMBL_768073 (CHEMBL1833029)
Ki 10±n/a nM
Citation Di Fabio, RPellacani, AFaedo, SRoth, APiccoli, LGerrard, PPorter, RAJohnson, CNThewlis, KDonati, DStasi, LSpada, SStemp, GNash, DBranch, CKindon, LMassagrande, MPoffe, ABraggio, SChiarparin, EMarchioro, CRatti, ECorsi, M Discovery process and pharmacological characterization of a novel dual orexin 1 and orexin 2 receptor antagonist useful for treatment of sleep disorders. Bioorg Med Chem Lett21:5562-7 (2011) 
 
Orexin/Hypocretin receptor type 1
Name:Orexin/Hypocretin receptor type 1
Type:Protein
Mol. Mass.:47554.50
Organism:Homo sapiens (Human)
Description:O43613
Residue:425
BDBM50419132
NameBDBM50419132
Synonyms:CHEMBL1830967
TypeSmall organic molecule
Emp. Form.C27H27NO2
Mol. Mass.397.5088
SMILESO=C(CC[C@@H]1CCCCN1C(=O)c1ccccc1-c1ccccc1)c1ccccc1