Reaction Details
TargetNeuromedin-K receptor
LigandBDBM50419333
Substrate/Competitorn/a
Meas. Tech.ChEMBL_775935 (CHEMBL1912678)
Ki 630.96±n/a nM
Citation Catalani, MPAlvaro, GBernasconi, GBettini, EBromidge, SMHeer, JTedesco, GTommasi, S Identification of novel NK1/NK3 dual antagonists for the potential treatment of schizophrenia. Bioorg Med Chem Lett21:6899-904 (2011) 
 
Neuromedin-K receptor
Name:Neuromedin-K receptor
Type:Enzyme
Mol. Mass.:52221.96
Organism:Homo sapiens (Human)
Description:P29371
Residue:465
BDBM50419333
NameBDBM50419333
Synonyms:CHEMBL1911970
TypeSmall organic molecule
Emp. Form.C31H30F7N3O4
Mol. Mass.641.5764
SMILESCN(C(=O)C(C)(C)c1cc(cc(c1)C(F)(F)F)C(F)(F)F)c1cnc(cc1-c1ccc(F)cc1C)C1CC(=O)NC1(CO)CO