Reaction Details
TargetSolute carrier family 22 member 1
LigandBDBM50026220
Substrate/Competitorn/a
Meas. Tech.ChEMBL_838487 (CHEMBL2076058)
IC50 1452000±n/a nM
Citation Urakami, YOkuda, MMasuda, SAkazawa, MSaito, HInui, K Distinct characteristics of organic cation transporters, OCT1 and OCT2, in the basolateral membrane of renal tubules. Pharm Res18:1528-34 (2001) Solute carrier family 22 member 1
Name:Solute carrier family 22 member 1
Type:Enzyme Catalytic Domain
Mol. Mass.:61538.40
Organism:RAT
Description:Adrenaline alpha1 0 RAT::Q63089
Residue:556
BDBM50026220
NameBDBM50026220
Synonyms:2-hydroxy-N,N,N-trimethylethanaminium CHEMBL293410 N-trimethylethanolamine choline | trimethylethanolamine
TypeSmall organic molecule
Emp. Form.C5H14NO
Mol. Mass.104.1702
SMILESC[N+](C)(C)CCO