Reaction Details
TargetSolute carrier family 22 member 2
LigandBDBM50420181
Substrate/Competitorn/a
Meas. Tech.ChEMBL_838484 (CHEMBL2076055)
IC50 1700±n/a nM
Citation Urakami, YOkuda, MMasuda, SAkazawa, MSaito, HInui, K Distinct characteristics of organic cation transporters, OCT1 and OCT2, in the basolateral membrane of renal tubules. Pharm Res18:1528-34 (2001) Solute carrier family 22 member 2
Name:Solute carrier family 22 member 2
Type:Enzyme Catalytic Domain
Mol. Mass.:62348.38
Organism:RAT
Description:Adrenaline alpha2 0 RAT::Q9R0W2
Residue:555
BDBM50420181
NameBDBM50420181
Synonyms:CHEMBL2074704
TypeSmall organic molecule
Emp. Form.C20H44N
Mol. Mass.298.5695
SMILESCCCCC[N+](CCCCC)(CCCCC)CCCCC