Reaction Details
TargetATP-dependent translocase ABCB1
LigandBDBM79180
Substrate/Competitorn/a
Meas. Tech.ChEMBL_835975 (CHEMBL2077113)
IC50 22000±n/a nM
Citation Katoh, MNakajima, MYamazaki, HYokoi, T Inhibitory potencies of 1,4-dihydropyridine calcium antagonists to P-glycoprotein-mediated transport: comparison with the effects on CYP3A4. Pharm Res17:1189-97 (2000) ATP-dependent translocase ABCB1
Name:ATP-dependent translocase ABCB1
Type:Protein
Mol. Mass.:141503.50
Organism:Homo sapiens (Human)
Description:P08183
Residue:1280
BDBM79180
NameBDBM79180
Synonyms:2-(2-aminoethoxymethyl)-4-(2-chlorophenyl)-6-methyl-1,4-dihydropyridine-3,5-dicarboxylic acid O3-ethyl ester O5-methyl ester;benzenesulfonic acid AMLODIPINE SMR000814710 benzenesulfonic acid;O3-ethyl O5-methyl 2-(2-azanylethoxymethyl)-4-(2-chlorophenyl)-6-methyl-1,4-dihydropyridine-3,5-dicarboxylate | cid_60496
TypeSmall organic molecule
Emp. Form.C20H25ClN2O5
Mol. Mass.408.876
SMILESCCOC(=O)C1=C(COCCN)N=C(C)C(C1c1ccccc1Cl)C(=O)OC