Reaction Details
TargetE3 ubiquitin-protein ligase Mdm2
LigandBDBM50420264
Substrate/Competitorn/a
Meas. Tech.ChEMBL_841972 (CHEMBL2091389)
Ki>100000±n/a nM
Citation Guo, ZZhuang, CZhu, LZhang, YYao, JDong, GWang, SLiu, YChen, HSheng, CMiao, ZZhang, W Structure-activity relationship and antitumor activity of thio-benzodiazepines as p53-MDM2 protein-protein interaction inhibitors. Eur J Med Chem56:10-16 (2012) 
 
E3 ubiquitin-protein ligase Mdm2
Name:E3 ubiquitin-protein ligase Mdm2
Type:Oncoprotein
Mol. Mass.:55196.54
Organism:Homo sapiens (Human)
Description:Q00987
Residue:491
BDBM50420264
NameBDBM50420264
Synonyms:CHEMBL2089153
TypeSmall organic molecule
Emp. Form.C24H16Cl2F2N2O3S
Mol. Mass.521.363
SMILESCOC(=O)C(N1C(c2ccc(Cl)cc2)C(=S)Nc2cc(F)c(F)cc2C1=O)c1ccc(Cl)cc1