Reaction Details
TargetE3 ubiquitin-protein ligase Mdm2
LigandBDBM50420266
Substrate/Competitorn/a
Meas. Tech.ChEMBL_841972 (CHEMBL2091389)
Ki 315±n/a nM
Citation Guo, ZZhuang, CZhu, LZhang, YYao, JDong, GWang, SLiu, YChen, HSheng, CMiao, ZZhang, W Structure-activity relationship and antitumor activity of thio-benzodiazepines as p53-MDM2 protein-protein interaction inhibitors. Eur J Med Chem56:10-16 (2012) 
 
E3 ubiquitin-protein ligase Mdm2
Name:E3 ubiquitin-protein ligase Mdm2
Type:Oncoprotein
Mol. Mass.:55196.54
Organism:Homo sapiens (Human)
Description:Q00987
Residue:491
BDBM50420266
NameBDBM50420266
Synonyms:CHEMBL2089201
TypeSmall organic molecule
Emp. Form.C24H17Cl2FN2O3S
Mol. Mass.503.373
SMILESCOC(=O)C(N1C(c2ccc(Cl)cc2)C(=S)Nc2ccc(Cl)cc2C1=O)c1ccc(F)cc1