Reaction Details
TargetProtein-glutamine gamma-glutamyltransferase K
LigandBDBM50420458
Substrate/Competitorn/a
Meas. Tech.ChEMBL_841032 (CHEMBL2091158)
IC50 950±n/a nM
Citation Prime, MEAndersen, OABarker, JJBrooks, MACheng, RKToogood-Johnson, ICourtney, SMBrookfield, FAYarnold, CJMarston, RWJohnson, PDJohnsen, SFPalfrey, JJVaidya, DErfan, SIchihara, OFelicetti, BPalan, SPedret-Dunn, ASchaertl, SSternberger, IEbneth, AScheel, AWinkler, DToledo-Sherman, LBeconi, MMacdonald, DMuñoz-Sanjuan, IDominguez, CWityak, J Discovery and structure-activity relationship of potent and selective covalent inhibitors of transglutaminase 2 for Huntington's disease. J Med Chem55:1021-46 (2012) 
 
Protein-glutamine gamma-glutamyltransferase K
Name:Protein-glutamine gamma-glutamyltransferase K
Type:Protein
Mol. Mass.:89778.63
Organism:Homo sapiens (Human)
Description:n/a
Residue:817
BDBM50420458
NameBDBM50420458
Synonyms:CHEMBL2086891
TypeSmall organic molecule
Emp. Form.C18H24ClN3O5S
Mol. Mass.429.918
SMILESCC(C)(C)OC(=O)N1CCN(CC1)S(=O)(=O)c1ccc(NC(=O)C=C)cc1Cl