Reaction Details
TargetProtein-glutamine gamma-glutamyltransferase E
LigandBDBM50420449
Substrate/Competitorn/a
Meas. Tech.ChEMBL_841033 (CHEMBL2091159)
IC50>80000±n/a nM
Citation Prime, MEAndersen, OABarker, JJBrooks, MACheng, RKToogood-Johnson, ICourtney, SMBrookfield, FAYarnold, CJMarston, RWJohnson, PDJohnsen, SFPalfrey, JJVaidya, DErfan, SIchihara, OFelicetti, BPalan, SPedret-Dunn, ASchaertl, SSternberger, IEbneth, AScheel, AWinkler, DToledo-Sherman, LBeconi, MMacdonald, DMuñoz-Sanjuan, IDominguez, CWityak, J Discovery and structure-activity relationship of potent and selective covalent inhibitors of transglutaminase 2 for Huntington's disease. J Med Chem55:1021-46 (2012) 
 
Protein-glutamine gamma-glutamyltransferase E
Name:Protein-glutamine gamma-glutamyltransferase E
Type:Protein
Mol. Mass.:76625.90
Organism:Homo sapiens (Human)
Description:n/a
Residue:693
BDBM50420449
NameBDBM50420449
Synonyms:CHEMBL2086539
TypeSmall organic molecule
Emp. Form.C20H22N4O5S
Mol. Mass.430.477
SMILESC=CC(=O)Nc1ccc(cn1)S(=O)(=O)N1CCN(CC1)C(=O)OCc1ccccc1