Reaction Details
TargetCoagulation factor XIII A chain
LigandBDBM50420459
Substrate/Competitorn/a
Meas. Tech.ChEMBL_841034 (CHEMBL2091160)
IC50 180±n/a nM
Citation Prime, MEAndersen, OABarker, JJBrooks, MACheng, RKToogood-Johnson, ICourtney, SMBrookfield, FAYarnold, CJMarston, RWJohnson, PDJohnsen, SFPalfrey, JJVaidya, DErfan, SIchihara, OFelicetti, BPalan, SPedret-Dunn, ASchaertl, SSternberger, IEbneth, AScheel, AWinkler, DToledo-Sherman, LBeconi, MMacdonald, DMuñoz-Sanjuan, IDominguez, CWityak, J Discovery and structure-activity relationship of potent and selective covalent inhibitors of transglutaminase 2 for Huntington's disease. J Med Chem55:1021-46 (2012) 
 
Coagulation factor XIII A chain
Name:Coagulation factor XIII A chain
Type:PROTEIN
Mol. Mass.:83261.29
Organism:Homo sapiens (Human)
Description:ChEMBL_1475048
Residue:732
BDBM50420459
NameBDBM50420459
Synonyms:CHEMBL2086528
TypeSmall organic molecule
Emp. Form.C24H31N3O4S
Mol. Mass.457.586
SMILESC=CC(=O)Nc1ccc(cc1)S(=O)(=O)N1CCN(CC1)C(=O)C12CC3CC(CC(C3)C1)C2