Reaction Details
TargetProtein-glutamine gamma-glutamyltransferase 2
LigandBDBM50420450
Substrate/Competitorn/a
Meas. Tech.ChEMBL_841030 (CHEMBL2091156)
IC50 180±n/a nM
Citation Prime, MEAndersen, OABarker, JJBrooks, MACheng, RKToogood-Johnson, ICourtney, SMBrookfield, FAYarnold, CJMarston, RWJohnson, PDJohnsen, SFPalfrey, JJVaidya, DErfan, SIchihara, OFelicetti, BPalan, SPedret-Dunn, ASchaertl, SSternberger, IEbneth, AScheel, AWinkler, DToledo-Sherman, LBeconi, MMacdonald, DMuñoz-Sanjuan, IDominguez, CWityak, J Discovery and structure-activity relationship of potent and selective covalent inhibitors of transglutaminase 2 for Huntington's disease. J Med Chem55:1021-46 (2012) 
 
Protein-glutamine gamma-glutamyltransferase 2
Name:Protein-glutamine gamma-glutamyltransferase 2
Type:Protein
Mol. Mass.:77309.30
Organism:Homo sapiens (Human)
Description:P21980
Residue:687
BDBM50420450
NameBDBM50420450
Synonyms:CHEMBL2086540
TypeSmall organic molecule
Emp. Form.C16H20N4O4S
Mol. Mass.364.419
SMILESC=CC(=O)Nc1ccc(cn1)S(=O)(=O)N1CCN(CC1)C(=O)C1CC1