Reaction Details
TargetDipeptidyl peptidase 4
LigandBDBM50420638
Substrate/Competitorn/a
Meas. Tech.ChEMBL_842192 (CHEMBL2091655)
IC50 74±n/a nM
Citation Jadav, PBahekar, RShah, SRPatel, DJoharapurkar, AKshirsagar, SJain, MShaikh, MSairam, KV Long-acting peptidomimetics based DPP-IV inhibitors. Bioorg Med Chem Lett22:3516-21 (2012) 
 
Dipeptidyl peptidase 4
Name:Dipeptidyl peptidase 4
Type:Enzyme
Mol. Mass.:88271.01
Organism:Homo sapiens (Human)
Description:P27487
Residue:766
BDBM50420638
NameBDBM50420638
Synonyms:CHEMBL2086598
TypeSmall organic molecule
Emp. Form.C16H20FN3O3
Mol. Mass.321.3467
SMILESNC(=O)[C@@H]1CCCN1C(=O)CCCNC(=O)c1ccc(F)cc1