Reaction Details
TargetDual specificity mitogen-activated protein kinase kinase 1
LigandBDBM50420697
Substrate/Competitorn/a
Meas. Tech.ChEMBL_842369 (CHEMBL2091986)
EC50 1.5±n/a nM
Citation Heald, RAJackson, PSavy, PJones, MGancia, EBurton, BNewman, RBoggs, JChan, EChan, JChoo, EMerchant, MRudewicz, PUltsch, MWiesmann, CYue, QBelvin, MPrice, S Discovery of novel allosteric mitogen-activated protein kinase kinase (MEK) 1,2 inhibitors possessing bidentate Ser212 interactions. J Med Chem55:4594-604 (2012) 
 
Dual specificity mitogen-activated protein kinase kinase 1
Name:Dual specificity mitogen-activated protein kinase kinase 1
Type:Other Protein Type
Mol. Mass.:43439.03
Organism:Homo sapiens (Human)
Description:Full-length human MEK-1 was generated by PCR and purified as a fusion protein from Escherichia coli lysates.
Residue:393
BDBM50420697
NameBDBM50420697
Synonyms:CHEMBL2087081
TypeSmall organic molecule
Emp. Form.C18H16FIN4O2
Mol. Mass.466.2481
SMILESFc1cc(I)ccc1Nc1c(ccc2[nH]ncc12)C(=O)NOCC1CC1