Reaction Details
TargetDual specificity mitogen-activated protein kinase kinase 1
LigandBDBM50420694
Substrate/Competitorn/a
Meas. Tech.ChEMBL_842395 (CHEMBL2092012)
EC50 7.2±n/a nM
Citation Heald, RAJackson, PSavy, PJones, MGancia, EBurton, BNewman, RBoggs, JChan, EChan, JChoo, EMerchant, MRudewicz, PUltsch, MWiesmann, CYue, QBelvin, MPrice, S Discovery of novel allosteric mitogen-activated protein kinase kinase (MEK) 1,2 inhibitors possessing bidentate Ser212 interactions. J Med Chem55:4594-604 (2012) 
 
Dual specificity mitogen-activated protein kinase kinase 1
Name:Dual specificity mitogen-activated protein kinase kinase 1
Type:Other Protein Type
Mol. Mass.:43439.03
Organism:Homo sapiens (Human)
Description:Full-length human MEK-1 was generated by PCR and purified as a fusion protein from Escherichia coli lysates.
Residue:393
BDBM50420694
NameBDBM50420694
Synonyms:CHEMBL2087078
TypeSmall organic molecule
Emp. Form.C17H14F2IN3O4
Mol. Mass.489.212
SMILESC[C@H](O)CONC(=O)c1oc2c(F)cncc2c1Nc1ccc(I)cc1F