Reaction Details
TargetDual specificity mitogen-activated protein kinase kinase 1
LigandBDBM50420696
Substrate/Competitorn/a
Meas. Tech.ChEMBL_842395 (CHEMBL2092012)
EC50 3.7±n/a nM
Citation Heald, RAJackson, PSavy, PJones, MGancia, EBurton, BNewman, RBoggs, JChan, EChan, JChoo, EMerchant, MRudewicz, PUltsch, MWiesmann, CYue, QBelvin, MPrice, S Discovery of novel allosteric mitogen-activated protein kinase kinase (MEK) 1,2 inhibitors possessing bidentate Ser212 interactions. J Med Chem55:4594-604 (2012) 
 
Dual specificity mitogen-activated protein kinase kinase 1
Name:Dual specificity mitogen-activated protein kinase kinase 1
Type:Other Protein Type
Mol. Mass.:43439.03
Organism:Homo sapiens (Human)
Description:Full-length human MEK-1 was generated by PCR and purified as a fusion protein from Escherichia coli lysates.
Residue:393
BDBM50420696
NameBDBM50420696
Synonyms:CHEMBL2087080
TypeSmall organic molecule
Emp. Form.C17H16FIN4O4
Mol. Mass.486.2362
SMILESOC[C@@H](O)CONC(=O)c1ccc2[nH]ncc2c1Nc1ccc(I)cc1F