Reaction Details
TargetFibroblast growth factor receptor 1
LigandBDBM50420959
Substrate/Competitorn/a
Meas. Tech.ChEMBL_840547 (CHEMBL2090012)
IC50 2.51±n/a nM
Citation Norman, RASchott, AKAndrews, DMBreed, JFoote, KMGarner, APOgg, DOrme, JPPink, JHRoberts, KRudge, DAThomas, APLeach, AG Protein-ligand crystal structures can guide the design of selective inhibitors of the FGFR tyrosine kinase. J Med Chem55:5003-12 (2012) 
 
Fibroblast growth factor receptor 1
Name:Fibroblast growth factor receptor 1
Type:Receptor
Mol. Mass.:91861.70
Organism:Homo sapiens (Human)
Description:P11362
Residue:822
BDBM50420959
NameBDBM50420959
Synonyms:CHEMBL2088095
TypeSmall organic molecule
Emp. Form.C20H20BrN7O
Mol. Mass.454.323
SMILESCc1cc(CNc2ncc(Br)c(Nc3cc(CCc4ccccc4)n[nH]3)n2)on1