Reaction Details
TargetFibroblast growth factor receptor 1
LigandBDBM50420961
Substrate/Competitorn/a
Meas. Tech.ChEMBL_840547 (CHEMBL2090012)
IC50 2±n/a nM
Citation Norman, RASchott, AKAndrews, DMBreed, JFoote, KMGarner, APOgg, DOrme, JPPink, JHRoberts, KRudge, DAThomas, APLeach, AG Protein-ligand crystal structures can guide the design of selective inhibitors of the FGFR tyrosine kinase. J Med Chem55:5003-12 (2012) 
 
Fibroblast growth factor receptor 1
Name:Fibroblast growth factor receptor 1
Type:Receptor
Mol. Mass.:91861.70
Organism:Homo sapiens (Human)
Description:P11362
Residue:822
BDBM50420961
NameBDBM50420961
Synonyms:CHEMBL2088096
TypeSmall organic molecule
Emp. Form.C22H25N7O3
Mol. Mass.435.479
SMILESCOc1cc(CCc2cc(Nc3ccnc(NCc4cc(C)no4)n3)[nH]n2)cc(OC)c1