Reaction Details
TargetVascular endothelial growth factor receptor 2
LigandBDBM50420958
Substrate/Competitorn/a
Meas. Tech.ChEMBL_840548 (CHEMBL2090013)
IC50 158.49±n/a nM
Citation Norman, RASchott, AKAndrews, DMBreed, JFoote, KMGarner, APOgg, DOrme, JPPink, JHRoberts, KRudge, DAThomas, APLeach, AG Protein-ligand crystal structures can guide the design of selective inhibitors of the FGFR tyrosine kinase. J Med Chem55:5003-12 (2012) 
 
Vascular endothelial growth factor receptor 2
Name:Vascular endothelial growth factor receptor 2
Type:Receptor Tyrosine Kinase
Mol. Mass.:151510.97
Organism:Homo sapiens (Human)
Description:P35968
Residue:1356
BDBM50420958
NameBDBM50420958
Synonyms:CHEMBL2088094
TypeSmall organic molecule
Emp. Form.C15H18BrN7O
Mol. Mass.392.254
SMILESCCCc1cc(Nc2nc(NCc3cc(C)no3)ncc2Br)[nH]n1