Reaction Details
TargetInsulin-like growth factor 1 receptor
LigandBDBM50420958
Substrate/Competitorn/a
Meas. Tech.ChEMBL_840552 (CHEMBL2090017)
IC50 501.19±n/a nM
Citation Norman, RASchott, AKAndrews, DMBreed, JFoote, KMGarner, APOgg, DOrme, JPPink, JHRoberts, KRudge, DAThomas, APLeach, AG Protein-ligand crystal structures can guide the design of selective inhibitors of the FGFR tyrosine kinase. J Med Chem55:5003-12 (2012) 
 
Insulin-like growth factor 1 receptor
Name:Insulin-like growth factor 1 receptor
Type:Protein
Mol. Mass.:154776.79
Organism:Homo sapiens (Human)
Description:P08069
Residue:1367
BDBM50420958
NameBDBM50420958
Synonyms:CHEMBL2088094
TypeSmall organic molecule
Emp. Form.C15H18BrN7O
Mol. Mass.392.254
SMILESCCCc1cc(Nc2nc(NCc3cc(C)no3)ncc2Br)[nH]n1