Reaction Details
TargetMitogen-activated protein kinase 11
LigandBDBM50421128
Substrate/Competitorn/a
Meas. Tech.ChEMBL_839530 (CHEMBL2090337)
IC50 66±n/a nM
Citation Tynebor, RMChen, MHNatarajan, SRO'Neill, EAThompson, JEFitzgerald, CEO'Keefe, SJDoherty, JB Synthesis and biological activity of pyridopyridazin-6-one p38a MAP kinase inhibitors. Part 2. Bioorg Med Chem Lett22:5979-83 (2012) 
 
Mitogen-activated protein kinase 11
Name:Mitogen-activated protein kinase 11
Type:Enzyme
Mol. Mass.:41390.66
Organism:Mus musculus (mouse)
Description:Q9WUI1
Residue:364
BDBM50421128
NameBDBM50421128
Synonyms:CHEMBL2088583
TypeSmall organic molecule
Emp. Form.C23H13F3N4O3
Mol. Mass.450.3695
SMILESCc1nnc(o1)-c1ccc(F)c(c1)-c1c2ccc(Oc3ccc(F)cc3F)nn2ccc1=O