Reaction Details
TargetBeta-lactamase
LigandBDBM21642
Substrate/Competitorn/a
Meas. Tech.ChEMBL_839906 (CHEMBL2090107)
IC50 25800±n/a nM
Citation Chen, PHorton, LBMikulski, RLDeng, LSundriyal, SPalzkill, TSong, Y 2-Substituted 4,5-dihydrothiazole-4-carboxylic acids are novel inhibitors of metallo-ß-lactamases. Bioorg Med Chem Lett22:6229-32 (2012) 
 
Beta-lactamase
Name:Beta-lactamase
Type:Enzyme
Mol. Mass.:28177.23
Organism:Bacillus anthracis
Description:Q93T40
Residue:256
BDBM21642
NameBDBM21642
Synonyms:(2S)-1-[(2S)-2-methyl-3-sulfanylpropanoyl]pyrrolidine-2-carboxylic acid Capozide Lopirin SQ14534 | US11491146, Compound L-Captopril
TypeSmall organic molecule
Emp. Form.C9H15NO3S
Mol. Mass.217.285
SMILESC[C@H](CS)C(=O)N1CCC[C@H]1C(O)=O